読者です 読者をやめる 読者になる 読者になる

スティーブジョブスに俺はなる!!

毎日全力を出し切り、自分史上最高を出し続けたい!

GG開発4日目:Graidleでorg.grails.plugin:spring-security-core:2.0-RC4が使えない

Gradle 開発日誌 spring security Grails

タイトル通り、どハマり。

何が悪いのか、googleで探しても原因が見つからない。

きっと、バージョンなんだとアテを付けてるが色々やっても解決できず。

仕方ないので、stackoverflowで質問を投げてみた。 


BUILD FAILED by org.grails.plugins: spring-security-core:2.0-RC4 on Gradle - Stack Overflow

どなたか回答お願いします m(. .)m

 

ちなみに、build.gradleはこんな感じです。 

buildscript {
repositories{
jcenter()
}
dependencies {
classpath 'org.grails:grails-gradle-plugin:2.1.2'
}
}
apply plugin: 'grails'

version = '0.0.1'

grails{
grailsVersion = '2.4.4'
}

repositories {
grails.central()
mavenLocal()
mavenCentral()
maven { url "http://repo.grails.org/grails/core" }
maven { url "http://repo.spring.io/milestone" }
maven { url "http://maven.springframework.org/release" }
}

dependencies {
bootstrap "org.grails.plugins:tomcat:7.0.55"
compile 'org.grails.plugins:spring-security-core:2.0-RC4'
compile 'org.grails.plugins:cache:1.1.8'
compile 'org.grails.plugins:scaffolding:2.1.2'
compile 'org.grails.plugins:resources:1.2.14'
compile 'org.grails.plugins:asset-pipeline:1.9.9'
runtime 'mysql:mysql-connector-java:5.1.29'
test "org.grails:grails-datastore-test-support:1.0.2-grails-2.4"
}

 

gradle run --stacktraceの実行結果は以下のような感じ

 

:run
objc[4590]: Class JavaLaunchHelper is implemented in both /Library/Java/JavaVirtualMachines/jdk1.8.0.jdk/Contents/Home/bin/java and /Library/Java/JavaVirtualMachines/jdk1.8.0.jdk/Contents/Home/jre/lib/libinstrument.dylib. One of the two will be used. Which one is undefined.
| Loading Grails 2.4.4
| Configuring classpath
| Running pre-compiled script
| Running pre-compiled script.
| Environment set to development
| Environment set to development.
| Environment set to development..
| Environment set to development...
| Environment set to development....
| Environment set to development.....
| Packaging Grails application
| Installing zip spring-security-core-2.0-RC4.zip...
| Installing zip spring-security-core-2.0-RC4.zip....
| Installing zip spring-security-core-2.0-RC4.zip.....
| Installed plugin spring-security-core-2.0-RC4

*******************************************************
* You've installed the Spring Security Core plugin.   *
*                                                     *
* Next run the "s2-quickstart" script to initialize   *
* Spring Security and create your domain classes.     *
*                                                     *
*******************************************************
| Installed plugin spring-security-core-2.0-RC4.
| Installed plugin spring-security-core-2.0-RC4..
| Installed plugin spring-security-core-2.0-RC4...
| Installed plugin spring-security-core-2.0-RC4....
| Installed plugin spring-security-core-2.0-RC4.....
| Error Fatal error during compilation java.lang.NoClassDefFoundError:
 net/sf/ehcache/config/CacheConfiguration (Use --stacktrace to see the full trace)
:run FAILED

FAILURE: Build failed with an exception.

* What went wrong:
Execution failed for task ':run'.
> Process 'command  '/Library/Java/JavaVirtualMachines/jdk1.8.0.jdk/Contents/Home/bin/java'' finished with non-zero exit value 1

* Try:
Run with --info or --debug option to get more log output.

* Exception is:
org.gradle.api.tasks.TaskExecutionException: Execution failed for task ':run'.
    at org.gradle.api.internal.tasks.execution.ExecuteActionsTaskExecuter.executeActions(ExecuteActionsTaskExecuter.java:69)
    at org.gradle.api.internal.tasks.execution.ExecuteActionsTaskExecuter.execute(ExecuteActionsTaskExecuter.java:46)
    at org.gradle.api.internal.tasks.execution.PostExecutionAnalysisTaskExecuter.execute(PostExecutionAnalysisTaskExecuter.java:35)
    at org.gradle.api.internal.tasks.execution.SkipUpToDateTaskExecuter.execute(SkipUpToDateTaskExecuter.java:64)
    at org.gradle.api.internal.tasks.execution.ValidatingTaskExecuter.execute(ValidatingTaskExecuter.java:58)
    at org.gradle.api.internal.tasks.execution.SkipEmptySourceFilesTaskExecuter.execute(SkipEmptySourceFilesTaskExecuter.java:42)
    at org.gradle.api.internal.tasks.execution.SkipTaskWithNoActionsExecuter.execute(SkipTaskWithNoActionsExecuter.java:52)
    at org.gradle.api.internal.tasks.execution.SkipOnlyIfTaskExecuter.execute(SkipOnlyIfTaskExecuter.java:53)
    at org.gradle.api.internal.tasks.execution.ExecuteAtMostOnceTaskExecuter.execute(ExecuteAtMostOnceTaskExecuter.java:43)
    at org.gradle.api.internal.AbstractTask.executeWithoutThrowingTaskFailure(AbstractTask.java:305)
    at org.gradle.execution.taskgraph.AbstractTaskPlanExecutor$TaskExecutorWorker.executeTask(AbstractTaskPlanExecutor.java:79)
    at org.gradle.execution.taskgraph.AbstractTaskPlanExecutor$TaskExecutorWorker.processTask(AbstractTaskPlanExecutor.java:63)
    at org.gradle.execution.taskgraph.AbstractTaskPlanExecutor$TaskExecutorWorker.run(AbstractTaskPlanExecutor.java:51)
    at org.gradle.execution.taskgraph.DefaultTaskPlanExecutor.process(DefaultTaskPlanExecutor.java:23)
    at org.gradle.execution.taskgraph.DefaultTaskGraphExecuter.execute(DefaultTaskGraphExecuter.java:88)
    at org.gradle.execution.SelectedTaskExecutionAction.execute(SelectedTaskExecutionAction.java:29)
    at org.gradle.execution.DefaultBuildExecuter.execute(DefaultBuildExecuter.java:62)
    at org.gradle.execution.DefaultBuildExecuter.access$200(DefaultBuildExecuter.java:23)
    at org.gradle.execution.DefaultBuildExecuter$2.proceed(DefaultBuildExecuter.java:68)
    at org.gradle.execution.DryRunBuildExecutionAction.execute(DryRunBuildExecutionAction.java:32)
    at org.gradle.execution.DefaultBuildExecuter.execute(DefaultBuildExecuter.java:62)
    at org.gradle.execution.DefaultBuildExecuter.execute(DefaultBuildExecuter.java:55)
    at org.gradle.initialization.DefaultGradleLauncher.doBuildStages(DefaultGradleLauncher.java:149)
    at org.gradle.initialization.DefaultGradleLauncher.doBuild(DefaultGradleLauncher.java:106)
    at org.gradle.initialization.DefaultGradleLauncher.run(DefaultGradleLauncher.java:86)
    at org.gradle.launcher.exec.InProcessBuildActionExecuter$DefaultBuildController.run(InProcessBuildActionExecuter.java:80)
    at org.gradle.launcher.cli.ExecuteBuildAction.run(ExecuteBuildAction.java:33)
    at org.gradle.launcher.cli.ExecuteBuildAction.run(ExecuteBuildAction.java:24)
    at org.gradle.launcher.exec.InProcessBuildActionExecuter.execute(InProcessBuildActionExecuter.java:36)
    at org.gradle.launcher.exec.InProcessBuildActionExecuter.execute(InProcessBuildActionExecuter.java:26)
    at org.gradle.launcher.cli.RunBuildAction.run(RunBuildAction.java:51)
    at org.gradle.internal.Actions$RunnableActionAdapter.execute(Actions.java:171)
    at org.gradle.launcher.cli.CommandLineActionFactory$ParseAndBuildAction.execute(CommandLineActionFactory.java:237)
    at org.gradle.launcher.cli.CommandLineActionFactory$ParseAndBuildAction.execute(CommandLineActionFactory.java:210)
    at org.gradle.launcher.cli.JavaRuntimeValidationAction.execute(JavaRuntimeValidationAction.java:35)
    at org.gradle.launcher.cli.JavaRuntimeValidationAction.execute(JavaRuntimeValidationAction.java:24)
    at org.gradle.launcher.cli.CommandLineActionFactory$WithLogging.execute(CommandLineActionFactory.java:206)
    at org.gradle.launcher.cli.CommandLineActionFactory$WithLogging.execute(CommandLineActionFactory.java:169)
    at org.gradle.launcher.cli.ExceptionReportingAction.execute(ExceptionReportingAction.java:33)
    at org.gradle.launcher.cli.ExceptionReportingAction.execute(ExceptionReportingAction.java:22)
    at org.gradle.launcher.Main.doAction(Main.java:33)
    at org.gradle.launcher.bootstrap.EntryPoint.run(EntryPoint.java:45)
    at org.gradle.launcher.bootstrap.ProcessBootstrap.runNoExit(ProcessBootstrap.java:54)
    at org.gradle.launcher.bootstrap.ProcessBootstrap.run(ProcessBootstrap.java:35)
    at org.gradle.launcher.GradleMain.main(GradleMain.java:23)
Caused by: org.gradle.process.internal.ExecException: Process 'command '/Library/Java/JavaVirtualMachines/jdk1.8.0.jdk/Contents/Home/bin/java'' finished with non-zero exit value 1
    at org.gradle.process.internal.DefaultExecHandle$ExecResultImpl.assertNormalExitValue(DefaultExecHandle.java:365)
    at org.gradle.process.ExecResult$assertNormalExitValue$0.call(Unknown Source)
    at org.grails.gradle.plugin.tasks.GrailsTask.executeCommand(GrailsTask.groovy:145)
    at org.gradle.internal.reflect.JavaMethod.invoke(JavaMethod.java:63)
    at org.gradle.api.internal.project.taskfactory.AnnotationProcessingTaskFactory$StandardTaskAction.doExecute(AnnotationProcessingTaskFactory.java:218)
    at org.gradle.api.internal.project.taskfactory.AnnotationProcessingTaskFactory$StandardTaskAction.execute(AnnotationProcessingTaskFactory.java:211)
    at org.gradle.api.internal.project.taskfactory.AnnotationProcessingTaskFactory$StandardTaskAction.execute(AnnotationProcessingTaskFactory.java:200)
    at org.gradle.api.internal.AbstractTask$TaskActionWrapper.execute(AbstractTask.java:579)
    at org.gradle.api.internal.AbstractTask$TaskActionWrapper.execute(AbstractTask.java:562)
    at org.gradle.api.internal.tasks.execution.ExecuteActionsTaskExecuter.executeAction(ExecuteActionsTaskExecuter.java:80)
    at org.gradle.api.internal.tasks.execution.ExecuteActionsTaskExecuter.executeActions(ExecuteActionsTaskExecuter.java:61)
    ... 44 more


BUILD FAILED